Reaction Details
TargetMelanocyte-stimulating hormone receptor
LigandBDBM50217788
Substrate/Competitorn/a
Meas. Tech.ChEMBL_448689 (CHEMBL896689)
Ki 1600±n/a nM
Citation Mutulis, FKreicberga, JYahorava, SMutule, IBorisova-Jan, LYahorau, AMuceniece, RAzena, SVeiksina, SPetrovska, RWikberg, JE Design and synthesis of a library of tertiary amides: evaluation as mimetics of the melanocortins' active core. Bioorg Med Chem15:5787-810 (2007) 
 
Melanocyte-stimulating hormone receptor
Name:Melanocyte-stimulating hormone receptor
Type:PROTEIN
Mol. Mass.:35238.60
Organism:Mus musculus
Description:ChEMBL_1498846
Residue:315
BDBM50217788
NameBDBM50217788
Synonyms:(Z)-N-((4-(aminomethyl)cyclohexyl)methyl)-N-(2-chloro-3-phenylallyl)-4-(1H-indol-3-yl)butanamide | CHEMBL238368
TypeSmall organic molecule
Emp. Form.C29H36ClN3O
Mol. Mass.478.069
SMILESNCC1CCC(CN(C\C(Cl)=C\c2ccccc2)C(=O)CCCc2c[nH]c3ccccc23)CC1