Reaction Details
TargetMelanocyte-stimulating hormone receptor
LigandBDBM50217674
Substrate/Competitorn/a
Meas. Tech.ChEMBL_448689 (CHEMBL896689)
Ki 2300±n/a nM
Citation Mutulis, FKreicberga, JYahorava, SMutule, IBorisova-Jan, LYahorau, AMuceniece, RAzena, SVeiksina, SPetrovska, RWikberg, JE Design and synthesis of a library of tertiary amides: evaluation as mimetics of the melanocortins' active core. Bioorg Med Chem15:5787-810 (2007) 
 
Melanocyte-stimulating hormone receptor
Name:Melanocyte-stimulating hormone receptor
Type:PROTEIN
Mol. Mass.:35238.60
Organism:Mus musculus
Description:ChEMBL_1498846
Residue:315
BDBM50217674
NameBDBM50217674
Synonyms:(Z)-N-(4-((4-aminocyclohexyl)methyl)cyclohexyl)-N-(2-chloro-3-phenylallyl)-4-(1H-indol-3-yl)butanamide | CHEMBL236861
TypeSmall organic molecule
Emp. Form.C34H44ClN3O
Mol. Mass.546.186
SMILESNC1CCC(CC2CCC(CC2)N(C\C(Cl)=C\c2ccccc2)C(=O)CCCc2c[nH]c3ccccc23)CC1