Reaction Details
Target5-hydroxytryptamine receptor 6
LigandBDBM50217900
Substrate/Competitorn/a
Meas. Tech.ChEMBL_448716 (CHEMBL897862)
Ki 1±n/a nM
Citation Elokdah, HLi, DMcFarlane, GBernotas, RCRobichaud, AJMagolda, RLZhang, GMSmith, DSchechter, LE Novel 1-(azacyclyl)-3-arylsulfonyl-1H-pyrrolo[2,3-b]pyridines as 5-HT6 agonists and antagonists. Bioorg Med Chem15:6208-26 (2007) 
 
5-hydroxytryptamine receptor 6
Name:5-hydroxytryptamine receptor 6
Type:G Protein-Coupled Receptor (GPCR)
Mol. Mass.:46968.43
Organism:Homo sapiens (Human)
Description:P50406
Residue:440
BDBM50217900
NameBDBM50217900
Synonyms:3-(6-chloro-imidazo[2,1-b]thiazole-5-sulfonyl)-1-pyrrolidin-3-yl-1H-pyrrolo[2,3-b]pyridine | CHEMBL236103
TypeSmall organic molecule
Emp. Form.C16H16ClN5O2S2
Mol. Mass.409.914
SMILESClC1=NC2SC=CN2C1S(=O)(=O)c1cn(C2CCNC2)c2ncccc12