Reaction Details
TargetKappa-type opioid receptor
LigandBDBM50217956
Substrate/Competitorn/a
Meas. Tech.ChEMBL_444758 (CHEMBL895005)
Ki 0.650000±n/a nM
Citation Hiebel, ACLee, YSBilsky, EGiuvelis, DDeschamps, JRParrish, DAAceto, MDMay, ELHarris, LSCoop, ADersch, CMPartilla, JSRothman, RBCheng, KJacobson, AERice, KC Probes for narcotic receptor mediated phenomena. 34. Synthesis and structure-activity relationships of a potent mu-agonist delta-antagonist and an exceedingly potent antinociceptive in the enantiomeric C9-substituted 5-(3-hydroxyphenyl)-N-phenylethylmorphan series. J Med Chem50:3765-76 (2007) 
 
Kappa-type opioid receptor
Name:Kappa-type opioid receptor
Type:G Protein-Coupled Receptor (GPCR)
Mol. Mass.:42648.76
Organism:Homo sapiens (Human)
Description:P41145
Residue:380
BDBM50217956
NameBDBM50217956
Synonyms:(1R,5S)-(+)-5-(3-hydroxyphenyl)-9-methylene-2-phenethyl-2-azabicyclo[3.3.1]nonane | CHEMBL242226
TypeSmall organic molecule
Emp. Form.C23H27NO
Mol. Mass.333.4666
SMILESOc1cccc(c1)[C@]12CCC[C@@H](N(CCc3ccccc3)CC1)C2=C