Reaction Details
TargetBeta-2 adrenergic receptor
LigandBDBM50218166
Substrate/Competitorn/a
Meas. Tech.ChEMBL_457029 (CHEMBL924393)
Ki 10±n/a nM
Citation Lafontaine, JADay, RFDibrino, JHadcock, JRHargrove, DMLinhares, MMartin, KAMaurer, TSNardone, NATess, DADasilva-Jardine, P Discovery of potent and orally bioavailable heterocycle-based beta3-adrenergic receptor agonists, potential therapeutics for the treatment of obesity. Bioorg Med Chem Lett17:5245-50 (2007) 
 
Beta-2 adrenergic receptor
Name:Beta-2 adrenergic receptor
Type:n/a
Mol. Mass.:46461.69
Organism:Homo sapiens (Human)
Description:P07550
Residue:413
BDBM50218166
NameBDBM50218166
Synonyms:(R)-2-(2-(4-(oxazol-4-yl)phenoxy)ethylamino)-1-(pyridin-3-yl)ethanol | CHEMBL249336
TypeSmall organic molecule
Emp. Form.C18H19N3O3
Mol. Mass.325.3618
SMILESO[C@@H](CNCCOc1ccc(cc1)-c1cocn1)c1cccnc1