Reaction Details
TargetBeta-1 adrenergic receptor
LigandBDBM50218173
Substrate/Competitorn/a
Meas. Tech.ChEMBL_457030 (CHEMBL924394)
Ki 400±n/a nM
Citation Lafontaine, JADay, RFDibrino, JHadcock, JRHargrove, DMLinhares, MMartin, KAMaurer, TSNardone, NATess, DADasilva-Jardine, P Discovery of potent and orally bioavailable heterocycle-based beta3-adrenergic receptor agonists, potential therapeutics for the treatment of obesity. Bioorg Med Chem Lett17:5245-50 (2007) 
 
Beta-1 adrenergic receptor
Name:Beta-1 adrenergic receptor
Type:G Protein-Coupled Receptor (GPCR)
Mol. Mass.:51338.40
Organism:Homo sapiens (Human)
Description:P08588
Residue:477
BDBM50218173
NameBDBM50218173
Synonyms:(R)-2-(2-(4-(2-methyloxazol-4-yl)phenoxy)ethylamino)-1-(pyridin-3-yl)ethanol | CHEMBL249534
TypeSmall organic molecule
Emp. Form.C19H21N3O3
Mol. Mass.339.3883
SMILESCc1nc(co1)-c1ccc(OCCNC[C@H](O)c2cccnc2)cc1