Reaction Details
TargetBeta-1 adrenergic receptor
LigandBDBM50218180
Substrate/Competitorn/a
Meas. Tech.ChEMBL_457030 (CHEMBL924394)
Ki 37±n/a nM
Citation Lafontaine, JADay, RFDibrino, JHadcock, JRHargrove, DMLinhares, MMartin, KAMaurer, TSNardone, NATess, DADasilva-Jardine, P Discovery of potent and orally bioavailable heterocycle-based beta3-adrenergic receptor agonists, potential therapeutics for the treatment of obesity. Bioorg Med Chem Lett17:5245-50 (2007) 
 
Beta-1 adrenergic receptor
Name:Beta-1 adrenergic receptor
Type:G Protein-Coupled Receptor (GPCR)
Mol. Mass.:51338.40
Organism:Homo sapiens (Human)
Description:P08588
Residue:477
BDBM50218180
NameBDBM50218180
Synonyms:(R)-2-(2-(4-(2-ethylthiazol-4-yl)phenoxy)ethylamino)-1-(pyridin-3-yl)ethanol | CHEMBL399785
TypeSmall organic molecule
Emp. Form.C20H23N3O2S
Mol. Mass.369.481
SMILESCCc1nc(cs1)-c1ccc(OCCNC[C@H](O)c2cccnc2)cc1