Reaction Details
TargetBeta-1 adrenergic receptor
LigandBDBM50218185
Substrate/Competitorn/a
Meas. Tech.ChEMBL_457030 (CHEMBL924394)
Ki 120±n/a nM
Citation Lafontaine, JADay, RFDibrino, JHadcock, JRHargrove, DMLinhares, MMartin, KAMaurer, TSNardone, NATess, DADasilva-Jardine, P Discovery of potent and orally bioavailable heterocycle-based beta3-adrenergic receptor agonists, potential therapeutics for the treatment of obesity. Bioorg Med Chem Lett17:5245-50 (2007) 
 
Beta-1 adrenergic receptor
Name:Beta-1 adrenergic receptor
Type:G Protein-Coupled Receptor (GPCR)
Mol. Mass.:51338.40
Organism:Homo sapiens (Human)
Description:P08588
Residue:477
BDBM50218185
NameBDBM50218185
Synonyms:(1R)-1-(pyridin-3-yl)-2-(2-(4-(2-(pyridin-3-yl)thiazol-4-yl)phenoxy)ethylamino)ethanol | CHEMBL250146
TypeSmall organic molecule
Emp. Form.C23H22N4O2S
Mol. Mass.418.511
SMILESO[C@@H](CNCCOc1ccc(cc1)-c1csc(n1)-c1cccnc1)c1cccnc1