Reaction Details
TargetCannabinoid receptor 2
LigandBDBM5035
Substrate/Competitorn/a
Meas. Tech.ChEMBL_448730 (CHEMBL897876)
EC50 110±n/a nM
Citation Ohta, HIshizaka, TYoshinaga, MMorita, ATomishima, YToda, YSaito, S Sulfonamide derivatives as new potent and selective CB2 cannabinoid receptor agonists. Bioorg Med Chem Lett17:5133-5 (2007) 
 
Cannabinoid receptor 2
Name:Cannabinoid receptor 2
Type:G Protein-Coupled Receptor (GPCR)
Mol. Mass.:39690.94
Organism:Homo sapiens (Human)
Description:P34972
Residue:360
BDBM5035
NameBDBM5035
Synonyms:CHEMBL235747 N-[(2Z)-5-tert-butyl-3,4-dimethyl-2,3-dihydro-1,3-thiazol-2-ylidene]benzenesulfonamide | thiazolidenebenzenesulfonamide deriv. 10r
TypeSmall organic molecule
Emp. Form.C15H20N2O2S2
Mol. Mass.324.462
SMILESCc1c(s\c(=N/S(=O)(=O)c2ccccc2)n1C)C(C)(C)C