Reaction Details
TargetCoagulation factor X
LigandBDBM50218291
Substrate/Competitorn/a
Meas. Tech.ChEMBL_448736 (CHEMBL897883)
Ki 0.58±n/a nM
Citation Qiao, JXWang, TCWang, GZCheney, DLHe, KRendina, ARXin, BLuettgen, JMKnabb, RMWexler, RRLam, PY Enantiopure five-membered cyclicdiamine derivatives as potent and selective inhibitors of factor Xa. Improving in vitro metabolic stability via core modifications. Bioorg Med Chem Lett17:5041-8 (2007) 
 
Coagulation factor X
Name:Coagulation factor X
Type:Enzyme
Mol. Mass.:54726.60
Organism:Homo sapiens (Human)
Description:n/a
Residue:488
BDBM50218291
NameBDBM50218291
Synonyms:CHEMBL394129 | N-((3R,4S)-1-acetyl-4-(4-(2-oxopyridin-1(2H)-yl)benzamido)pyrrolidin-3-yl)-5-chlorothiophene-2-carboxamide
TypeSmall organic molecule
Emp. Form.C23H21ClN4O4S
Mol. Mass.484.955
SMILESCC(=O)N1C[C@@H](NC(=O)c2ccc(Cl)s2)[C@H](C1)NC(=O)c1ccc(cc1)-n1ccccc1=O