Reaction Details
TargetCoagulation factor X
LigandBDBM50218294
Substrate/Competitorn/a
Meas. Tech.ChEMBL_448736 (CHEMBL897883)
Ki 0.93±n/a nM
Citation Qiao, JXWang, TCWang, GZCheney, DLHe, KRendina, ARXin, BLuettgen, JMKnabb, RMWexler, RRLam, PY Enantiopure five-membered cyclicdiamine derivatives as potent and selective inhibitors of factor Xa. Improving in vitro metabolic stability via core modifications. Bioorg Med Chem Lett17:5041-8 (2007) 
 
Coagulation factor X
Name:Coagulation factor X
Type:Enzyme
Mol. Mass.:54726.60
Organism:Homo sapiens (Human)
Description:n/a
Residue:488
BDBM50218294
NameBDBM50218294
Synonyms:(3R,4S)-2-methoxyethyl 3-(2-chlorothiophene-5-carboxamido)-4-(4-(2-oxopyridin-1(2H)-yl)benzamido)pyrrolidine-1-carboxylate | CHEMBL235369
TypeSmall organic molecule
Emp. Form.C25H25ClN4O6S
Mol. Mass.545.007
SMILESCOCCOC(=O)N1C[C@@H](NC(=O)c2ccc(Cl)s2)[C@H](C1)NC(=O)c1ccc(cc1)-n1ccccc1=O