Reaction Details
TargetRetinoic acid receptor RXR-alpha
LigandBDBM50218463
Substrate/Competitorn/a
Meas. Tech.ChEMBL_448792 (CHEMBL897938)
IC50 970±n/a nM
Citation Sakaki, JKonishi, KKishida, MGunji, HKanazawa, TUchiyama, HFukaya, HMitani, HKimura, M Synthesis and structure-activity relationship of RXR antagonists based on the diazepinylbenzoic acid structure. Bioorg Med Chem Lett17:4808-11 (2007) 
 
Retinoic acid receptor RXR-alpha
Name:Retinoic acid receptor RXR-alpha
Type:PROTEIN
Mol. Mass.:50820.38
Organism:Homo sapiens (Human)
Description:ChEMBL_1456363
Residue:462
BDBM50218463
NameBDBM50218463
Synonyms:4-(5,7,7,10,10-pentamethyl-2-phenylacetylamino-7,8,9,10-tetrahydro-5H-5,13-diaza-benzo[4,5]cyclohepta[1,2-b]naphthalen-12-yl)-benzoic acid | CHEMBL392858
TypeSmall organic molecule
Emp. Form.C37H37N3O3
Mol. Mass.571.708
SMILESCN1c2ccc(NC(=O)Cc3ccccc3)cc2N=C(c2ccc(cc2)C(O)=O)c2cc3c(cc12)C(C)(C)CCC3(C)C