Reaction Details
TargetRetinoic acid receptor RXR-alpha
LigandBDBM50218483
Substrate/Competitorn/a
Meas. Tech.ChEMBL_448791 (CHEMBL897937)
IC50 3400±n/a nM
Citation Sakaki, JKonishi, KKishida, MGunji, HKanazawa, TUchiyama, HFukaya, HMitani, HKimura, M Synthesis and structure-activity relationship of RXR antagonists based on the diazepinylbenzoic acid structure. Bioorg Med Chem Lett17:4808-11 (2007) 
 
Retinoic acid receptor RXR-alpha
Name:Retinoic acid receptor RXR-alpha
Type:PROTEIN
Mol. Mass.:50820.38
Organism:Homo sapiens (Human)
Description:ChEMBL_1456363
Residue:462
BDBM50218483
NameBDBM50218483
Synonyms:4-[5,7,7,10,10-pentamethyl-2-(naphthalene-1-sulfonylamino)-7,8,9,10-tetrahydro-5H-5,13-diaza-benzo[4,5]cyclohepta[1,2-b]naphthalen-12-yl]-benzoic acid | CHEMBL391572
TypeSmall organic molecule
Emp. Form.C39H37N3O4S
Mol. Mass.643.794
SMILESCN1c2ccc(NS(=O)(=O)c3cccc4ccccc34)cc2N=C(c2ccc(cc2)C(O)=O)c2cc3c(cc12)C(C)(C)CCC3(C)C