Reaction Details
TargetCholinesterase
LigandBDBM50218522
Substrate/Competitorn/a
Meas. Tech.ChEMBL_444936 (CHEMBL894086)
IC50>0.000±n/a nM
Commentsmodified from >0.000010
Citation Piazzi, LCavalli, ABelluti, FBisi, AGobbi, SRizzo, SBartolini, MAndrisano, VRecanatini, MRampa, A Extensive SAR and computational studies of 3-{4-[(benzylmethylamino)methyl]phenyl}-6,7-dimethoxy-2H-2-chromenone (AP2238) derivatives. J Med Chem50:4250-4 (2007) 
 
Cholinesterase
Name:Cholinesterase
Type:Homotetramer
Mol. Mass.:68422.27
Organism:Homo sapiens (Human)
Description:P06276
Residue:602
BDBM50218522
NameBDBM50218522
Synonyms:6-amino-3-{4-[(benzylmethylamino)methyl]phenyl}-chromen-2-one | CHEMBL244624
TypeSmall organic molecule
Emp. Form.C24H22N2O2
Mol. Mass.370.4437
SMILESCN(Cc1ccccc1)Cc1ccc(cc1)-c1cc2cc(N)ccc2oc1=O