Reaction Details
TargetCholinesterase
LigandBDBM10949
Substrate/Competitorn/a
Meas. Tech.ChEMBL_444936 (CHEMBL894086)
IC50 48900±n/a nM
Citation Piazzi, LCavalli, ABelluti, FBisi, AGobbi, SRizzo, SBartolini, MAndrisano, VRecanatini, MRampa, A Extensive SAR and computational studies of 3-{4-[(benzylmethylamino)methyl]phenyl}-6,7-dimethoxy-2H-2-chromenone (AP2238) derivatives. J Med Chem50:4250-4 (2007) 
 
Cholinesterase
Name:Cholinesterase
Type:Homotetramer
Mol. Mass.:68422.27
Organism:Homo sapiens (Human)
Description:P06276
Residue:602
BDBM10949
NameBDBM10949
Synonyms:3-(4-{[Benzyl(methyl)amino]methyl}-phenyl)-6,7-dimethoxy-2H-2-chromenone AP2238 | CHEMBL75121
TypeSmall organic molecule
Emp. Form.C26H25NO4
Mol. Mass.415.481
SMILESCOc1cc2cc(-c3ccc(CN(C)Cc4ccccc4)cc3)c(=O)oc2cc1OC