Reaction Details
TargetSerine/threonine-protein kinase Chk1
LigandBDBM50218738
Substrate/Competitorn/a
Meas. Tech.ChEMBL_444965 (CHEMBL894121)
IC50 82±n/a nM
Citation Wang, LSullivan, GMHexamer, LAHasvold, LAThalji, RPrzytulinska, MTao, ZFLi, GChen, ZXiao, ZGu, WZXue, JBui, MHMerta, PKovar, PBouska, JJZhang, HPark, CStewart, KDSham, HLSowin, TJRosenberg, SHLin, NH Design, synthesis, and biological activity of 5,10-dihydro-dibenzo[b,e][1,4]diazepin-11-one-based potent and selective Chk-1 inhibitors. J Med Chem50:4162-76 (2007) 
 
Serine/threonine-protein kinase Chk1
Name:Serine/threonine-protein kinase Chk1
Type:Enzyme Catalytic Domain
Mol. Mass.:54443.02
Organism:Homo sapiens (Human)
Description:gi_166295192
Residue:476
BDBM50218738
NameBDBM50218738
Synonyms:3-(4-hydroxy-3-methoxyphenyl)-5,10-dihydro-11H-dibenzo-[b,e][1,4]diazepin-11-one CHEMBL241966
TypeSmall organic molecule
Emp. Form.C20H16N2O3
Mol. Mass.332.3526
SMILESCOc1cc(ccc1O)-c1ccc2c(Nc3ccccc3NC2=O)c1