Reaction Details
TargetSerine/threonine-protein kinase Chk1
LigandBDBM50218737
Substrate/Competitorn/a
Meas. Tech.ChEMBL_444965 (CHEMBL894121)
IC50>10000±n/a nM
Citation Wang, LSullivan, GMHexamer, LAHasvold, LAThalji, RPrzytulinska, MTao, ZFLi, GChen, ZXiao, ZGu, WZXue, JBui, MHMerta, PKovar, PBouska, JJZhang, HPark, CStewart, KDSham, HLSowin, TJRosenberg, SHLin, NH Design, synthesis, and biological activity of 5,10-dihydro-dibenzo[b,e][1,4]diazepin-11-one-based potent and selective Chk-1 inhibitors. J Med Chem50:4162-76 (2007) 
 
Serine/threonine-protein kinase Chk1
Name:Serine/threonine-protein kinase Chk1
Type:Enzyme Catalytic Domain
Mol. Mass.:54443.02
Organism:Homo sapiens (Human)
Description:gi_166295192
Residue:476
BDBM50218737
NameBDBM50218737
Synonyms:3-(3-ethoxy-phenyl)-5,10-dihydro-dibenzo[b,e][1,4]diazepin-11-one | CHEMBL230445
TypeSmall organic molecule
Emp. Form.C21H18N2O2
Mol. Mass.330.3798
SMILESCCOc1cccc(c1)-c1ccc2c(Nc3ccccc3NC2=O)c1