Reaction Details
TargetSerine/threonine-protein kinase Chk1
LigandBDBM50218715
Substrate/Competitorn/a
Meas. Tech.ChEMBL_444965 (CHEMBL894121)
IC50 6±n/a nM
Citation Wang, LSullivan, GMHexamer, LAHasvold, LAThalji, RPrzytulinska, MTao, ZFLi, GChen, ZXiao, ZGu, WZXue, JBui, MHMerta, PKovar, PBouska, JJZhang, HPark, CStewart, KDSham, HLSowin, TJRosenberg, SHLin, NH Design, synthesis, and biological activity of 5,10-dihydro-dibenzo[b,e][1,4]diazepin-11-one-based potent and selective Chk-1 inhibitors. J Med Chem50:4162-76 (2007) 
 
Serine/threonine-protein kinase Chk1
Name:Serine/threonine-protein kinase Chk1
Type:Enzyme Catalytic Domain
Mol. Mass.:54443.02
Organism:Homo sapiens (Human)
Description:gi_166295192
Residue:476
BDBM50218715
NameBDBM50218715
Synonyms:2-[3-(3-methoxy-4-nitrophenyl)-11-oxo-10,11-dihydro-5Hdibenzo[b,e][1,4]diazepin-8-yl]-N,N-dimethylacetamide | CHEMBL243934
TypeSmall organic molecule
Emp. Form.C24H24N4O3
Mol. Mass.416.4724
SMILESCOc1cc(ccc1N)-c1ccc2c(Nc3ccc(CC(=O)N(C)C)cc3NC2=O)c1