Reaction Details
TargetSerine/threonine-protein kinase Chk1
LigandBDBM50218706
Substrate/Competitorn/a
Meas. Tech.ChEMBL_444965 (CHEMBL894121)
IC50 3±n/a nM
Citation Wang, LSullivan, GMHexamer, LAHasvold, LAThalji, RPrzytulinska, MTao, ZFLi, GChen, ZXiao, ZGu, WZXue, JBui, MHMerta, PKovar, PBouska, JJZhang, HPark, CStewart, KDSham, HLSowin, TJRosenberg, SHLin, NH Design, synthesis, and biological activity of 5,10-dihydro-dibenzo[b,e][1,4]diazepin-11-one-based potent and selective Chk-1 inhibitors. J Med Chem50:4162-76 (2007) 
 
Serine/threonine-protein kinase Chk1
Name:Serine/threonine-protein kinase Chk1
Type:Enzyme Catalytic Domain
Mol. Mass.:54443.02
Organism:Homo sapiens (Human)
Description:gi_166295192
Residue:476
BDBM50218706
NameBDBM50218706
Synonyms:CHEMBL429819 | methyl [3-(3-methoxy-4-nitrophenyl)-11-oxo-10,11-dihydro-5H-dibenzo[b,e][1,4]diazepin-8-yl]acetate
TypeSmall organic molecule
Emp. Form.C23H21N3O4
Mol. Mass.403.4305
SMILESCOC(=O)Cc1ccc2Nc3cc(ccc3C(=O)Nc2c1)-c1ccc(N)c(OC)c1