Reaction Details
TargetFibroblast growth factor receptor 1
LigandBDBM50218709
Substrate/Competitorn/a
Meas. Tech.ChEMBL_445019 (CHEMBL894172)
IC50>10000±n/a nM
Citation Wang, LSullivan, GMHexamer, LAHasvold, LAThalji, RPrzytulinska, MTao, ZFLi, GChen, ZXiao, ZGu, WZXue, JBui, MHMerta, PKovar, PBouska, JJZhang, HPark, CStewart, KDSham, HLSowin, TJRosenberg, SHLin, NH Design, synthesis, and biological activity of 5,10-dihydro-dibenzo[b,e][1,4]diazepin-11-one-based potent and selective Chk-1 inhibitors. J Med Chem50:4162-76 (2007) 
 
Fibroblast growth factor receptor 1
Name:Fibroblast growth factor receptor 1
Type:Receptor
Mol. Mass.:91861.70
Organism:Homo sapiens (Human)
Description:P11362
Residue:822
BDBM50218709
NameBDBM50218709
Synonyms:2-[3-(3-methoxy-4-nitrophenyl)-11-oxo-10,11-dihydro-5Hdibenzo[b,e][1,4]diazepin-8-yl]-2-methyl-N-(4-morpholin-4-ylphenyl)propanamide | CHEMBL389745
TypeSmall organic molecule
Emp. Form.C34H35N5O4
Mol. Mass.577.6728
SMILESCOc1cc(ccc1N)-c1ccc2c(Nc3ccc(cc3NC2=O)C(C)(C)C(=O)Nc2ccc(cc2)N2CCOCC2)c1