Reaction Details
TargetAurora kinase B
LigandBDBM50191440
Substrate/Competitorn/a
Meas. Tech.ChEMBL_445190 (CHEMBL894338)
IC50>100000±n/a nM
Citation Myrianthopoulos, VMagiatis, PFerandin, YSkaltsounis, ALMeijer, LMikros, E An integrated computational approach to the phenomenon of potent and selective inhibition of aurora kinases B and C by a series of 7-substituted indirubins. J Med Chem50:4027-37 (2007) 
 
Aurora kinase B
Name:Aurora kinase B
Type:Protein
Mol. Mass.:39327.72
Organism:Homo sapiens (Human)
Description:Q96GD4
Residue:344
BDBM50191440
NameBDBM50191440
Synonyms:(2'Z)-7-bromoindirubin | CHEMBL214173
TypeSmall organic molecule
Emp. Form.C16H9BrN2O2
Mol. Mass.341.159
SMILESOc1[nH]c2c(Br)cccc2c1C1=Nc2ccccc2C1=O