Reaction Details
TargetAurora kinase B
LigandBDBM50012188
Substrate/Competitorn/a
Meas. Tech.ChEMBL_445190 (CHEMBL894338)
IC50 900±n/a nM
Citation Myrianthopoulos, VMagiatis, PFerandin, YSkaltsounis, ALMeijer, LMikros, E An integrated computational approach to the phenomenon of potent and selective inhibition of aurora kinases B and C by a series of 7-substituted indirubins. J Med Chem50:4027-37 (2007) 
 
Aurora kinase B
Name:Aurora kinase B
Type:Protein
Mol. Mass.:39327.72
Organism:Homo sapiens (Human)
Description:Q96GD4
Residue:344
BDBM50012188
NameBDBM50012188
Synonyms:6BIO
TypeSmall organic molecule
Emp. Form.C16H10BrN3O2
Mol. Mass.356.174
SMILESO\N=C1\C(\Nc2ccccc\12)=C1\C(=O)Nc2cc(Br)ccc12