Reaction Details
TargetAurora kinase A
LigandBDBM50218891
Substrate/Competitorn/a
Meas. Tech.ChEMBL_445189 (CHEMBL894337)
IC50>100000±n/a nM
Citation Myrianthopoulos, VMagiatis, PFerandin, YSkaltsounis, ALMeijer, LMikros, E An integrated computational approach to the phenomenon of potent and selective inhibition of aurora kinases B and C by a series of 7-substituted indirubins. J Med Chem50:4027-37 (2007) 
 
Aurora kinase A
Name:Aurora kinase A
Type:Serine/threonine-protein kinase
Mol. Mass.:45830.98
Organism:Homo sapiens (Human)
Description:O14965
Residue:403
BDBM50218891
NameBDBM50218891
Synonyms:7-iodoindirubin-3-acetoxime | CHEMBL395077
TypeSmall organic molecule
Emp. Form.C18H12IN3O3
Mol. Mass.445.2107
SMILESCC(=O)ON=C1C(Nc2ccccc12)=C1C(=O)Nc2c1cccc2I