Reaction Details
TargetAdenosine receptor A3
LigandBDBM21173
Substrate/Competitorn/a
Meas. Tech.ChEMBL_445192 (CHEMBL894340)
Ki 1300±n/a nM
Citation Colotta, VCatarzi, DVarano, FCapelli, FLenzi, OFilacchioni, GMartini, CTrincavelli, LCiampi, OPugliese, AMPedata, FSchiesaro, AMorizzo, EMoro, S New 2-arylpyrazolo[3,4-c]quinoline derivatives as potent and selective human A3 adenosine receptor antagonists. Synthesis, pharmacological evaluation, and ligand-receptor modeling studies. J Med Chem50:4061-74 (2007) 
 
Adenosine receptor A3
Name:Adenosine receptor A3
Type:G Protein-Coupled Receptor (GPCR)
Mol. Mass.:36197.32
Organism:Homo sapiens (Human)
Description:P0DMS8
Residue:318
BDBM21173
NameBDBM21173
Synonyms:1,3-dipropyl-8-cyclopentylxanthine CHEMBL183 PD116948 | [3H]DPCPX
Typeradiolabeled ligand
Emp. Form.C16H24N4O2
Mol. Mass.304.3874
SMILESCCCn1c2nc([nH]c2c(=O)n(CCC)c1=O)C1CCCC1