Reaction Details
TargetMelanin-concentrating hormone receptor 1
LigandBDBM50219031
Substrate/Competitorn/a
Meas. Tech.ChEMBL_445279 (CHEMBL893404)
Ki 3.8±n/a nM
Citation Jiang, YChen, CALu, KDaniewska, IDe Leon, JKong, RForray, CLi, BHegde, LGWolinsky, TDCraig, DAWetzel, JMAndersen, KMarzabadi, MR Synthesis and SAR investigations for novel melanin-concentrating hormone 1 receptor (MCH1) antagonists Part 1. The discovery of arylacetamides as viable replacements for the dihydropyrimidinone moiety of an HTS hit. J Med Chem50:3870-82 (2007) 
 
Melanin-concentrating hormone receptor 1
Name:Melanin-concentrating hormone receptor 1
Type:Enzyme Catalytic Domain
Mol. Mass.:39075.64
Organism:RAT
Description:Melanin Concentrating Hormone 1 GPR24 RAT::P97639
Residue:353
BDBM50219031
NameBDBM50219031
Synonyms:1-(4-fluorophenyl)-N-(3-{4-[5-(isobutylamino)-2-methylphenyl]-1-piperidinyl}propyl)cyclohexanecarboxamide | CHEMBL244370
TypeSmall organic molecule
Emp. Form.C31H42FN3O2
Mol. Mass.507.6825
SMILESCC(C)C(=O)Nc1ccc(C)c(c1)C1CCN(CCCNC(=O)C2(CCCC2)c2ccc(F)cc2)CC1