Reaction Details
TargetMelanin-concentrating hormone receptor 1
LigandBDBM50219030
Substrate/Competitorn/a
Meas. Tech.ChEMBL_445279 (CHEMBL893404)
Ki 50±n/a nM
Citation Jiang, YChen, CALu, KDaniewska, IDe Leon, JKong, RForray, CLi, BHegde, LGWolinsky, TDCraig, DAWetzel, JMAndersen, KMarzabadi, MR Synthesis and SAR investigations for novel melanin-concentrating hormone 1 receptor (MCH1) antagonists Part 1. The discovery of arylacetamides as viable replacements for the dihydropyrimidinone moiety of an HTS hit. J Med Chem50:3870-82 (2007) 
 
Melanin-concentrating hormone receptor 1
Name:Melanin-concentrating hormone receptor 1
Type:Enzyme Catalytic Domain
Mol. Mass.:39075.64
Organism:RAT
Description:Melanin Concentrating Hormone 1 GPR24 RAT::P97639
Residue:353
BDBM50219030
NameBDBM50219030
Synonyms:CHEMBL243139 | N-{3-[1-(5-diphenylacetylamino-pentyl)-piperidin-4-yl]-phenyl-isobutyramide
TypeSmall organic molecule
Emp. Form.C33H41N3O2
Mol. Mass.511.6975
SMILESCC(C)C(=O)Nc1cccc(c1)C1CCN(CCCCNC(=O)C(c2ccccc2)c2ccccc2)CC1