Reaction Details
TargetMelanin-concentrating hormone receptor 1
LigandBDBM50219052
Substrate/Competitorn/a
Meas. Tech.ChEMBL_445304 (CHEMBL894445)
IC50 5400±n/a nM
Citation Chen, CAJiang, YLu, KDaniewska, IMazza, CGNegron, LForray, CParola, TLi, BHegde, LGWolinsky, TDCraig, DAKong, RWetzel, JMAndersen, KMarzabadi, MR Synthesis and SAR investigations for novel melanin-concentrating hormone 1 receptor (MCH1) antagonists part 2: A hybrid strategy combining key fragments of HTS hits. J Med Chem50:3883-90 (2007) 
 
Melanin-concentrating hormone receptor 1
Name:Melanin-concentrating hormone receptor 1
Type:Enzyme Catalytic Domain
Mol. Mass.:39075.64
Organism:RAT
Description:Melanin Concentrating Hormone 1 GPR24 RAT::P97639
Residue:353
BDBM50219052
NameBDBM50219052
Synonyms:2-methyl-N-[3-(1-{3-[3-(trifluoromethyl)phenoxy]benzyl}-4-piperidinyl)phenyl]-propanamide | CHEMBL244790
TypeSmall organic molecule
Emp. Form.C29H31F3N2O2
Mol. Mass.496.5638
SMILESCC(C)C(=O)Nc1cccc(c1)C1CCN(Cc2cccc(Oc3cccc(c3)C(F)(F)F)c2)CC1