Reaction Details
TargetMelanin-concentrating hormone receptor 1
LigandBDBM50219066
Substrate/Competitorn/a
Meas. Tech.ChEMBL_445301 (CHEMBL894442)
Ki 23±n/a nM
Citation Chen, CAJiang, YLu, KDaniewska, IMazza, CGNegron, LForray, CParola, TLi, BHegde, LGWolinsky, TDCraig, DAKong, RWetzel, JMAndersen, KMarzabadi, MR Synthesis and SAR investigations for novel melanin-concentrating hormone 1 receptor (MCH1) antagonists part 2: A hybrid strategy combining key fragments of HTS hits. J Med Chem50:3883-90 (2007) 
 
Melanin-concentrating hormone receptor 1
Name:Melanin-concentrating hormone receptor 1
Type:Enzyme Catalytic Domain
Mol. Mass.:39075.64
Organism:RAT
Description:Melanin Concentrating Hormone 1 GPR24 RAT::P97639
Residue:353
BDBM50219066
NameBDBM50219066
Synonyms:CHEMBL244578 | N-(3-{1-[3-(4-chlorophenoxy)benzyl]-4-piperidinyl}phenyl)-2methylpropanamide
TypeSmall organic molecule
Emp. Form.C28H31ClN2O2
Mol. Mass.463.011
SMILESCC(C)C(=O)Nc1cccc(c1)C1CCN(Cc2cccc(Oc3ccc(Cl)cc3)c2)CC1