Reaction Details
TargetMelanin-concentrating hormone receptor 1
LigandBDBM50219059
Substrate/Competitorn/a
Meas. Tech.ChEMBL_445301 (CHEMBL894442)
Ki 43±n/a nM
Citation Chen, CAJiang, YLu, KDaniewska, IMazza, CGNegron, LForray, CParola, TLi, BHegde, LGWolinsky, TDCraig, DAKong, RWetzel, JMAndersen, KMarzabadi, MR Synthesis and SAR investigations for novel melanin-concentrating hormone 1 receptor (MCH1) antagonists part 2: A hybrid strategy combining key fragments of HTS hits. J Med Chem50:3883-90 (2007) 
 
Melanin-concentrating hormone receptor 1
Name:Melanin-concentrating hormone receptor 1
Type:Enzyme Catalytic Domain
Mol. Mass.:39075.64
Organism:RAT
Description:Melanin Concentrating Hormone 1 GPR24 RAT::P97639
Residue:353
BDBM50219059
NameBDBM50219059
Synonyms:CHEMBL390212 | N-(3-{1-[3-(4-methoxyphenoxy)benzyl]-4-piperidinyl}phenyl)-2methylpropanamide
TypeSmall organic molecule
Emp. Form.C29H34N2O3
Mol. Mass.458.5919
SMILESCOc1ccc(Oc2cccc(CN3CCC(CC3)c3cccc(NC(=O)C(C)C)c3)c2)cc1