Reaction Details
TargetD(3) dopamine receptor
LigandBDBM50161214
Substrate/Competitorn/a
Meas. Tech.ChEMBL_445357 (CHEMBL894567)
Ki 0.7±n/a nM
Citation Grundt, PPrevatt, KMCao, JTaylor, MFloresca, CZChoi, JKJenkins, BGLuedtke, RRNewman, AH Heterocyclic analogues of N-(4-(4-(2,3-dichlorophenyl)piperazin-1-yl)butyl)arylcarboxamides with functionalized linking chains as novel dopamine D3 receptor ligands: potential substance abuse therapeutic agents. J Med Chem50:4135-46 (2007) 
 
D(3) dopamine receptor
Name:D(3) dopamine receptor
Type:n/a
Mol. Mass.:44243.43
Organism:Homo sapiens (Human)
Description:n/a
Residue:400
BDBM50161214
NameBDBM50161214
Synonyms:CHEMBL180010 N-{4-[4-(2,3-Dichloro-phenyl)-piperazin-1-yl]-but-2-enyl}-4-pyridin-2-yl-benzamide | PG-01037
TypeSmall organic molecule
Emp. Form.C26H26Cl2N4O
Mol. Mass.481.417
SMILESClc1cccc(N2CCN(C\C=C\CNC(=O)c3ccc(cc3)-c3ccccn3)CC2)c1Cl