Reaction Details
TargetD(1A) dopamine receptor
LigandBDBM50219137
Substrate/Competitorn/a
Meas. Tech.ChEMBL_445431 (CHEMBL895723)
Ki 3.2±n/a nM
Citation Enzensperger, CMüller, FKSchmalwasser, BWiecha, PTraber, HLehmann, J Dopamine/serotonin receptor ligands. 16.(1) Expanding dibenz[d,g]azecines to 11- and 12-membered homologues. Interaction with dopamine D(1)-D(5) receptors. J Med Chem50:4528-33 (2007) 
 
D(1A) dopamine receptor
Name:D(1A) dopamine receptor
Type:Enzyme
Mol. Mass.:49303.43
Organism:Homo sapiens (Human)
Description:P21728
Residue:446
BDBM50219137
NameBDBM50219137
Synonyms:7-methyl-6,7,8,9,10,15-hexahydro-5H-dibenzo[d,g]azacycloundecene-3-ol CHEMBL231070
TypeSmall organic molecule
Emp. Form.C19H23NO
Mol. Mass.281.392
SMILESCN1CCCc2ccccc2Cc2ccc(O)cc2CC1