Reaction Details
TargetD(1A) dopamine receptor
LigandBDBM50219142
Substrate/Competitorn/a
Meas. Tech.ChEMBL_445431 (CHEMBL895723)
Ki 18.5±n/a nM
Citation Enzensperger, CMüller, FKSchmalwasser, BWiecha, PTraber, HLehmann, J Dopamine/serotonin receptor ligands. 16.(1) Expanding dibenz[d,g]azecines to 11- and 12-membered homologues. Interaction with dopamine D(1)-D(5) receptors. J Med Chem50:4528-33 (2007) 
 
D(1A) dopamine receptor
Name:D(1A) dopamine receptor
Type:Enzyme
Mol. Mass.:49303.43
Organism:Homo sapiens (Human)
Description:P21728
Residue:446
BDBM50219142
NameBDBM50219142
Synonyms:3-methoxy-7-methyl-6,7,8,9,10,15-hexahydro-5H-dibenzo[d,g]azacycloundecene CHEMBL276778
TypeSmall organic molecule
Emp. Form.C20H25NO
Mol. Mass.295.4186
SMILESCOc1ccc2Cc3ccccc3CCCN(C)CCc2c1