Reaction Details
TargetAdenosine receptor A3
LigandBDBM50219388
Substrate/Competitorn/a
Meas. Tech.ChEMBL_457195 (CHEMBL940796)
Ki 280±n/a nM
Citation Gregg, ABottle, SEDevine, SMFigler, HLinden, JWhite, PPouton, CWUrmaliya, VScammells, PJ Dual acting antioxidant A1 adenosine receptor agonists. Bioorg Med Chem Lett17:5437-41 (2007) 
 
Adenosine receptor A3
Name:Adenosine receptor A3
Type:G Protein-Coupled Receptor (GPCR)
Mol. Mass.:36197.32
Organism:Homo sapiens (Human)
Description:P0DMS8
Residue:318
BDBM50219388
NameBDBM50219388
Synonyms:(2R,3S,4R,5R)-2-(hydroxymethyl)-5-(6-(1,1,3,3-tetramethylisoindolin-5-ylamino)-9H-purin-9-yl)-tetrahydrofuran-3,4-diol | CHEMBL249294
TypeSmall organic molecule
Emp. Form.C22H28N6O4
Mol. Mass.440.4955
SMILESCC1(C)NC(C)(C)c2cc(Nc3ncnc4n(cnc34)[C@@H]3O[C@H](CO)[C@@H](O)[C@H]3O)ccc12