Reaction Details
TargetAdenosine receptor A3
LigandBDBM50292323
Substrate/Competitorn/a
Meas. Tech.ChEMBL_457195 (CHEMBL940796)
Ki 790±n/a nM
Citation Gregg, ABottle, SEDevine, SMFigler, HLinden, JWhite, PPouton, CWUrmaliya, VScammells, PJ Dual acting antioxidant A1 adenosine receptor agonists. Bioorg Med Chem Lett17:5437-41 (2007) 
 
Adenosine receptor A3
Name:Adenosine receptor A3
Type:G Protein-Coupled Receptor (GPCR)
Mol. Mass.:36197.32
Organism:Homo sapiens (Human)
Description:P0DMS8
Residue:318
BDBM50292323
NameBDBM50292323
Synonyms:CHEMBL400567 | N6-(1,1,3,3-tetramethylisoindolin-2-yloxyl-5-yl) adenosine
TypeSmall organic molecule
Emp. Form.C22H27N6O5
Mol. Mass.455.487
SMILESCC1(C)N([O])C(C)(C)c2cc(Nc3ncnc4n(cnc34)[C@@H]3O[C@H](CO)[C@@H](O)[C@H]3O)ccc12