Reaction Details
TargetAndrogen receptor
LigandBDBM18216
Substrate/Competitorn/a
Meas. Tech.ChEMBL_457221 (CHEMBL940822)
IC50>10000±n/a nM
Citation Higuchi, RIThompson, AWChen, JHCaferro, TRCummings, MLDeckhut, CPAdams, METegley, CMEdwards, JPLópez, FJKallel, EAKaranewsky, DSSchrader, WTMarschke, KBZhi, L Potent, nonsteroidal selective androgen receptor modulators (SARMs) based on 8H-[1,4]oxazino[2,3-f]quinolin-8-ones. Bioorg Med Chem Lett17:5442-6 (2007) 
 
Androgen receptor
Name:Androgen receptor
Type:Receptor
Mol. Mass.:99185.27
Organism:Homo sapiens (Human)
Description:CHO cells were stably transfected with human AR gene.
Residue:920
BDBM18216
NameBDBM18216
Synonyms:(2R)-2-methyl-1-(2,2,2-trifluoroethyl)-9-(trifluoromethyl)-1H,2H,3H,6H,7H-quinolino[7,6-b][1,4]oxazin-7-one CHEMBL224263
TypeSmall organic molecule
Emp. Form.C15H12F6N2O2
Mol. Mass.366.2584
SMILESC[C@@H]1COc2cc3[nH]c(=O)cc(c3cc2N1CC(F)(F)F)C(F)(F)F