Reaction Details
TargetTyrosine-protein phosphatase non-receptor type 2
LigandBDBM50219570
Substrate/Competitorn/a
Meas. Tech.ChEMBL_445833 (CHEMBL896127)
Ki 5±n/a nM
Citation Wilson, DPWan, ZKXu, WXKirincich, SJFollows, BCJoseph-McCarthy, DForeman, KMoretto, AWu, JZhu, MBinnun, EZhang, YLTam, MErbe, DVTobin, JXu, XLeung, LShilling, ATam, SYMansour, TSLee, J Structure-based optimization of protein tyrosine phosphatase 1B inhibitors: from the active site to the second phosphotyrosine binding site. J Med Chem50:4681-98 (2007) 
 
Tyrosine-protein phosphatase non-receptor type 2
Name:Tyrosine-protein phosphatase non-receptor type 2
Type:Protein
Mol. Mass.:48481.80
Organism:Homo sapiens (Human)
Description:P17706
Residue:415
BDBM50219570
NameBDBM50219570
Synonyms:4-bromo-3-carboxymethoxy-5-{3-[(1-o-tolylcarbamoylpiperidin-4-ylmethyl)amino]phenyl}thiophene-2-carboxylic acid | CHEMBL397415
TypeSmall organic molecule
Emp. Form.C27H28BrN3O6S
Mol. Mass.602.497
SMILESCc1ccccc1NC(=O)N1CCC(CNc2cccc(c2)-c2sc(C(O)=O)c(OCC(O)=O)c2Br)CC1