Reaction Details
TargetTyrosine-protein phosphatase non-receptor type 2
LigandBDBM50219580
Substrate/Competitorn/a
Meas. Tech.ChEMBL_445833 (CHEMBL896127)
Ki 10±n/a nM
Citation Wilson, DPWan, ZKXu, WXKirincich, SJFollows, BCJoseph-McCarthy, DForeman, KMoretto, AWu, JZhu, MBinnun, EZhang, YLTam, MErbe, DVTobin, JXu, XLeung, LShilling, ATam, SYMansour, TSLee, J Structure-based optimization of protein tyrosine phosphatase 1B inhibitors: from the active site to the second phosphotyrosine binding site. J Med Chem50:4681-98 (2007) 
 
Tyrosine-protein phosphatase non-receptor type 2
Name:Tyrosine-protein phosphatase non-receptor type 2
Type:Protein
Mol. Mass.:48481.80
Organism:Homo sapiens (Human)
Description:P17706
Residue:415
BDBM50219580
NameBDBM50219580
Synonyms:4-bromo-3-(carboxymethoxy)-5-[3-({1-[(4-chlorobenzyl)sulfonyl]piperidin-4-yl}amino)phenyl]thiophene-2-carboxylic acid | CHEMBL230643
TypeSmall organic molecule
Emp. Form.C25H24BrClN2O7S2
Mol. Mass.643.954
SMILESOC(=O)COc1c(Br)c(sc1C(O)=O)-c1cccc(NC2CCN(CC2)S(=O)(=O)Cc2ccc(Cl)cc2)c1