Reaction Details
TargetTyrosine-protein phosphatase non-receptor type 1
LigandBDBM50219584
Substrate/Competitorn/a
Meas. Tech.ChEMBL_445832 (CHEMBL896126)
Ki 2±n/a nM
Citation Wilson, DPWan, ZKXu, WXKirincich, SJFollows, BCJoseph-McCarthy, DForeman, KMoretto, AWu, JZhu, MBinnun, EZhang, YLTam, MErbe, DVTobin, JXu, XLeung, LShilling, ATam, SYMansour, TSLee, J Structure-based optimization of protein tyrosine phosphatase 1B inhibitors: from the active site to the second phosphotyrosine binding site. J Med Chem50:4681-98 (2007) 
 
Tyrosine-protein phosphatase non-receptor type 1
Name:Tyrosine-protein phosphatase non-receptor type 1
Type:Protein phosphatase
Mol. Mass.:49963.76
Organism:Homo sapiens (Human)
Description:Human recombinant GST-fusion PTP1B (1-435).
Residue:435
BDBM50219584
NameBDBM50219584
Synonyms:5-{3-[(1-{[2-(acetylamino)benzyl]sulfonyl}piperidin-4-yl)amino]phenyl}-4-bromo-3-(carboxymethoxy)thiophene-2-carboxylic acid | CHEMBL230862
TypeSmall organic molecule
Emp. Form.C27H28BrN3O8S2
Mol. Mass.666.561
SMILESCC(=O)Nc1ccccc1CS(=O)(=O)N1CCC(CC1)Nc1cccc(c1)-c1sc(C(O)=O)c(OCC(O)=O)c1Br