Reaction Details
TargetReceptor-type tyrosine-protein phosphatase F
LigandBDBM14245
Substrate/Competitorn/a
Meas. Tech.ChEMBL_445835 (CHEMBL896129)
Ki>500000±n/a nM
Citation Wilson, DPWan, ZKXu, WXKirincich, SJFollows, BCJoseph-McCarthy, DForeman, KMoretto, AWu, JZhu, MBinnun, EZhang, YLTam, MErbe, DVTobin, JXu, XLeung, LShilling, ATam, SYMansour, TSLee, J Structure-based optimization of protein tyrosine phosphatase 1B inhibitors: from the active site to the second phosphotyrosine binding site. J Med Chem50:4681-98 (2007) 
 
Receptor-type tyrosine-protein phosphatase F
Name:Receptor-type tyrosine-protein phosphatase F
Type:Protein
Mol. Mass.:212869.85
Organism:Homo sapiens (Human)
Description:P10586
Residue:1907
BDBM14245
NameBDBM14245
Synonyms:4-bromo-3-(carboxymethoxy)-5-phenylthiophene-2-carboxylic acid Monocyclic thiophene analog 11
TypeSmall organic molecule
Emp. Form.C13H9BrO5S
Mol. Mass.357.177
SMILESOC(=O)COc1c(Br)c(sc1C(O)=O)-c1ccccc1