Reaction Details
TargetTyrosine-protein phosphatase non-receptor type 2
LigandBDBM50219583
Substrate/Competitorn/a
Meas. Tech.ChEMBL_445833 (CHEMBL896127)
Ki 12±n/a nM
Citation Wilson, DPWan, ZKXu, WXKirincich, SJFollows, BCJoseph-McCarthy, DForeman, KMoretto, AWu, JZhu, MBinnun, EZhang, YLTam, MErbe, DVTobin, JXu, XLeung, LShilling, ATam, SYMansour, TSLee, J Structure-based optimization of protein tyrosine phosphatase 1B inhibitors: from the active site to the second phosphotyrosine binding site. J Med Chem50:4681-98 (2007) 
 
Tyrosine-protein phosphatase non-receptor type 2
Name:Tyrosine-protein phosphatase non-receptor type 2
Type:Protein
Mol. Mass.:48481.80
Organism:Homo sapiens (Human)
Description:P17706
Residue:415
BDBM50219583
NameBDBM50219583
Synonyms:4-bromo-3-(carboxymethoxy)-5-[3-({1-[(2-{[(ethylamino)-carbonyl]amino}benzyl)sulfonyl]piperidin-4-yl}amino)phenyl]-thiophene-2-carboxylic acid | CHEMBL397903
TypeSmall organic molecule
Emp. Form.C28H31BrN4O8S2
Mol. Mass.695.602
SMILESCCNC(=O)Nc1ccccc1CS(=O)(=O)N1CCC(CC1)Nc1cccc(c1)-c1sc(C(O)=O)c(OCC(O)=O)c1Br