Reaction Details
TargetTyrosine-protein phosphatase non-receptor type 1
LigandBDBM50219590
Substrate/Competitorn/a
Meas. Tech.ChEMBL_445832 (CHEMBL896126)
Ki 310±n/a nM
Citation Wilson, DPWan, ZKXu, WXKirincich, SJFollows, BCJoseph-McCarthy, DForeman, KMoretto, AWu, JZhu, MBinnun, EZhang, YLTam, MErbe, DVTobin, JXu, XLeung, LShilling, ATam, SYMansour, TSLee, J Structure-based optimization of protein tyrosine phosphatase 1B inhibitors: from the active site to the second phosphotyrosine binding site. J Med Chem50:4681-98 (2007) 
 
Tyrosine-protein phosphatase non-receptor type 1
Name:Tyrosine-protein phosphatase non-receptor type 1
Type:Protein phosphatase
Mol. Mass.:49963.76
Organism:Homo sapiens (Human)
Description:Human recombinant GST-fusion PTP1B (1-435).
Residue:435
BDBM50219590
NameBDBM50219590
Synonyms:4-bromo-3-carboxymethoxy-5-[3-(tetrahydropyran-4-ylamino)phenyl]thiophene-2-carboxylic acid | CHEMBL394853
TypeSmall organic molecule
Emp. Form.C18H18BrNO6S
Mol. Mass.456.308
SMILESOC(=O)COc1c(Br)c(sc1C(O)=O)-c1cccc(NC2CCOCC2)c1