Reaction Details
TargetReceptor-type tyrosine-protein phosphatase F
LigandBDBM50219573
Substrate/Competitorn/a
Meas. Tech.ChEMBL_445835 (CHEMBL896129)
Ki>1000000±n/a nM
Citation Wilson, DPWan, ZKXu, WXKirincich, SJFollows, BCJoseph-McCarthy, DForeman, KMoretto, AWu, JZhu, MBinnun, EZhang, YLTam, MErbe, DVTobin, JXu, XLeung, LShilling, ATam, SYMansour, TSLee, J Structure-based optimization of protein tyrosine phosphatase 1B inhibitors: from the active site to the second phosphotyrosine binding site. J Med Chem50:4681-98 (2007) 
 
Receptor-type tyrosine-protein phosphatase F
Name:Receptor-type tyrosine-protein phosphatase F
Type:Protein
Mol. Mass.:212869.85
Organism:Homo sapiens (Human)
Description:P10586
Residue:1907
BDBM50219573
NameBDBM50219573
Synonyms:4-BROMO-3-(CARBOXYMETHOXY)-5-{3-[(3,3,5,5-TETRAMETHYLCYCLOHEXYL)AMINO]PHENYL}THIOPHENE-2-CARBOXYLIC ACID 4-bromo-3-carboxymethoxy-5-[3-(3,3,5,5-tetramethylcyclohexylamino)phenyl]thiophene-2-carboxylic acid | CHEMBL243942
TypeSmall organic molecule
Emp. Form.C23H28BrNO5S
Mol. Mass.510.441
SMILESCC1(C)CC(CC(C)(C)C1)Nc1cccc(c1)-c1sc(C(O)=O)c(OCC(O)=O)c1Br