Reaction Details
TargetTyrosine-protein phosphatase non-receptor type 1
LigandBDBM50219600
Substrate/Competitorn/a
Meas. Tech.ChEMBL_445832 (CHEMBL896126)
Ki 300±n/a nM
Citation Wilson, DPWan, ZKXu, WXKirincich, SJFollows, BCJoseph-McCarthy, DForeman, KMoretto, AWu, JZhu, MBinnun, EZhang, YLTam, MErbe, DVTobin, JXu, XLeung, LShilling, ATam, SYMansour, TSLee, J Structure-based optimization of protein tyrosine phosphatase 1B inhibitors: from the active site to the second phosphotyrosine binding site. J Med Chem50:4681-98 (2007) 
 
Tyrosine-protein phosphatase non-receptor type 1
Name:Tyrosine-protein phosphatase non-receptor type 1
Type:Protein phosphatase
Mol. Mass.:49963.76
Organism:Homo sapiens (Human)
Description:Human recombinant GST-fusion PTP1B (1-435).
Residue:435
BDBM50219600
NameBDBM50219600
Synonyms:5-[3-(1-benzylcarbamoylpiperidin-4-ylamino)phenyl]-4-bromo-3-carboxymethoxythiophene-2-carboxylic acid | CHEMBL396555
TypeSmall organic molecule
Emp. Form.C26H26BrN3O6S
Mol. Mass.588.47
SMILESOC(=O)COc1c(Br)c(sc1C(O)=O)-c1cccc(NC2CCN(CC2)C(=O)NCc2ccccc2)c1