Reaction Details
TargetTyrosine-protein phosphatase non-receptor type 1
LigandBDBM50219601
Substrate/Competitorn/a
Meas. Tech.ChEMBL_445832 (CHEMBL896126)
Ki 200±n/a nM
Citation Wilson, DPWan, ZKXu, WXKirincich, SJFollows, BCJoseph-McCarthy, DForeman, KMoretto, AWu, JZhu, MBinnun, EZhang, YLTam, MErbe, DVTobin, JXu, XLeung, LShilling, ATam, SYMansour, TSLee, J Structure-based optimization of protein tyrosine phosphatase 1B inhibitors: from the active site to the second phosphotyrosine binding site. J Med Chem50:4681-98 (2007) 
 
Tyrosine-protein phosphatase non-receptor type 1
Name:Tyrosine-protein phosphatase non-receptor type 1
Type:Protein phosphatase
Mol. Mass.:49963.76
Organism:Homo sapiens (Human)
Description:Human recombinant GST-fusion PTP1B (1-435).
Residue:435
BDBM50219601
NameBDBM50219601
Synonyms:4-bromo-3-carboxymethoxy-5-[3-(cyclohexylmethylamino)-phenyl]thiophene-2-carboxylic acid | CHEMBL243732
TypeSmall organic molecule
Emp. Form.C20H22BrNO5S
Mol. Mass.468.361
SMILESOC(=O)COc1c(Br)c(sc1C(O)=O)-c1cccc(NCC2CCCCC2)c1