Reaction Details
TargetDelta-type opioid receptor
LigandBDBM50219925
Substrate/Competitorn/a
Meas. Tech.ChEMBL_449059 (CHEMBL899317)
Ki 23±n/a nM
Citation Takeuchi, KHolloway, WGMcKinzie, JHSuter, TMStatnick, MASurface, PLEmmerson, PJThomas, EMSiegel, MGMatt, JEWolfe, CNMitch, CH Structure-activity relationship studies of carboxamido-biaryl ethers as opioid receptor antagonists (OpRAs). Part 1. Bioorg Med Chem Lett17:5349-52 (2007) 
 
Delta-type opioid receptor
Name:Delta-type opioid receptor
Type:G Protein-Coupled Receptor (GPCR)
Mol. Mass.:40382.98
Organism:Homo sapiens (Human)
Description:Competition binding assays were carried out using membrane preparations from transfected HN9.10 cells that constitutively expressed the delta opioid receptor.
Residue:372
BDBM50219925
NameBDBM50219925
Synonyms:6-(4-(2-(benzylamino)ethyl)phenoxy)nicotinamide | CHEMBL237066
TypeSmall organic molecule
Emp. Form.C21H21N3O2
Mol. Mass.347.4103
SMILESNC(=O)c1ccc(Oc2ccc(CCNCc3ccccc3)cc2)nc1