Reaction Details
TargetDelta-type opioid receptor
LigandBDBM50219914
Substrate/Competitorn/a
Meas. Tech.ChEMBL_449062 (CHEMBL898267)
Ki>5000±n/a nM
Citation Takeuchi, KHolloway, WGMcKinzie, JHSuter, TMStatnick, MASurface, PLEmmerson, PJThomas, EMSiegel, MGMatt, JEWolfe, CNMitch, CH Structure-activity relationship studies of carboxamido-biaryl ethers as opioid receptor antagonists (OpRAs). Part 1. Bioorg Med Chem Lett17:5349-52 (2007) 
 
Delta-type opioid receptor
Name:Delta-type opioid receptor
Type:G Protein-Coupled Receptor (GPCR)
Mol. Mass.:40382.98
Organism:Homo sapiens (Human)
Description:Competition binding assays were carried out using membrane preparations from transfected HN9.10 cells that constitutively expressed the delta opioid receptor.
Residue:372
BDBM50219914
NameBDBM50219914
Synonyms:(6-(4-((phenethylamino)methyl)phenoxy)pyridin-3-yl)(piperidin-1-yl)methanone | CHEMBL399814
TypeSmall organic molecule
Emp. Form.C26H29N3O2
Mol. Mass.415.5274
SMILESO=C(N1CCCCC1)c1ccc(Oc2ccc(CNCCc3ccccc3)cc2)nc1