Reaction Details
TargetKappa-type opioid receptor
LigandBDBM50045775
Substrate/Competitorn/a
Meas. Tech.ChEMBL_449061 (CHEMBL899319)
Ki 4.7±n/a nM
Citation Takeuchi, KHolloway, WGMcKinzie, JHSuter, TMStatnick, MASurface, PLEmmerson, PJThomas, EMSiegel, MGMatt, JEWolfe, CNMitch, CH Structure-activity relationship studies of carboxamido-biaryl ethers as opioid receptor antagonists (OpRAs). Part 1. Bioorg Med Chem Lett17:5349-52 (2007) 
 
Kappa-type opioid receptor
Name:Kappa-type opioid receptor
Type:G Protein-Coupled Receptor (GPCR)
Mol. Mass.:42648.76
Organism:Homo sapiens (Human)
Description:P41145
Residue:380
BDBM50045775
NameBDBM50045775
Synonyms:(3R,4R)3-[1-(3-Cyclohexyl-3-hydroxy-propyl)-3,4-dimethyl-piperidin-4-yl]-phenol 3-[(3R,4R)-1-((S)-3-Cyclohexyl-3-hydroxy-propyl)-3,4-dimethyl-piperidin-4-yl]-phenol CHEMBL300662 | LY-255582
TypeSmall organic molecule
Emp. Form.C22H35NO2
Mol. Mass.345.5188
SMILESC[C@H]1CN(CC[C@H](O)C2CCCCC2)CC[C@@]1(C)c1cccc(O)c1