Reaction Details
TargetKappa-type opioid receptor
LigandBDBM50219929
Substrate/Competitorn/a
Meas. Tech.ChEMBL_449061 (CHEMBL899319)
Ki>5000±n/a nM
Citation Takeuchi, KHolloway, WGMcKinzie, JHSuter, TMStatnick, MASurface, PLEmmerson, PJThomas, EMSiegel, MGMatt, JEWolfe, CNMitch, CH Structure-activity relationship studies of carboxamido-biaryl ethers as opioid receptor antagonists (OpRAs). Part 1. Bioorg Med Chem Lett17:5349-52 (2007) 
 
Kappa-type opioid receptor
Name:Kappa-type opioid receptor
Type:G Protein-Coupled Receptor (GPCR)
Mol. Mass.:42648.76
Organism:Homo sapiens (Human)
Description:P41145
Residue:380
BDBM50219929
NameBDBM50219929
Synonyms:6-(4-(2-(benzylamino)ethyl)phenoxy)nicotinic acid | CHEMBL236395
TypeSmall organic molecule
Emp. Form.C21H20N2O3
Mol. Mass.348.3951
SMILESOC(=O)c1ccc(Oc2ccc(CCNCc3ccccc3)cc2)nc1