Reaction Details
TargetMu-type opioid receptor
LigandBDBM50219928
Substrate/Competitorn/a
Meas. Tech.ChEMBL_449057 (CHEMBL899315)
Ki 235±n/a nM
Citation Takeuchi, KHolloway, WGMcKinzie, JHSuter, TMStatnick, MASurface, PLEmmerson, PJThomas, EMSiegel, MGMatt, JEWolfe, CNMitch, CH Structure-activity relationship studies of carboxamido-biaryl ethers as opioid receptor antagonists (OpRAs). Part 1. Bioorg Med Chem Lett17:5349-52 (2007) 
 
Mu-type opioid receptor
Name:Mu-type opioid receptor
Type:G Protein-Coupled Receptor (GPCR)
Mol. Mass.:44789.51
Organism:Homo sapiens (Human)
Description:P35372
Residue:400
BDBM50219928
NameBDBM50219928
Synonyms:CHEMBL238282 | N-methyl-6-[4-(phenethylamino-methyl)-phenoxy]-nicotinamidine
TypeSmall organic molecule
Emp. Form.C22H24N4O
Mol. Mass.360.4522
SMILESCN=C(N)c1ccc(Oc2ccc(CNCCc3ccccc3)cc2)nc1