Reaction Details
TargetKappa-type opioid receptor
LigandBDBM50219922
Substrate/Competitorn/a
Meas. Tech.ChEMBL_449061 (CHEMBL899319)
Ki>5000±n/a nM
Citation Takeuchi, KHolloway, WGMcKinzie, JHSuter, TMStatnick, MASurface, PLEmmerson, PJThomas, EMSiegel, MGMatt, JEWolfe, CNMitch, CH Structure-activity relationship studies of carboxamido-biaryl ethers as opioid receptor antagonists (OpRAs). Part 1. Bioorg Med Chem Lett17:5349-52 (2007) 
 
Kappa-type opioid receptor
Name:Kappa-type opioid receptor
Type:G Protein-Coupled Receptor (GPCR)
Mol. Mass.:42648.76
Organism:Homo sapiens (Human)
Description:P41145
Residue:380
BDBM50219922
NameBDBM50219922
Synonyms:CHEMBL396392 | N-methyl-6-(4-((phenethylamino)methyl)phenoxy)nicotinamide
TypeSmall organic molecule
Emp. Form.C22H23N3O2
Mol. Mass.361.4369
SMILESCNC(=O)c1ccc(Oc2ccc(CNCCc3ccccc3)cc2)nc1